Problem Starting Online Version
This topic has been viewed 22114 times and has 22 replies
Problem Starting Online Version
When trying to start the online version, I get the following error: ClassNotFoundException com.eteks.sweethome3d.applet.SweetHome3DApplet.
Don't see this in the FAQ or another thread. Runing IE9 with Java 10.7.2. Thanks for any help.
Don't see this in the FAQ or another thread. Runing IE9 with Java 10.7.2. Thanks for any help.
Re: Problem Starting Online Version
Do you get this error when you try to run the Online version at this page, or when you try to run your own version.
Emmanuel Puybaret, Sweet Home 3D creator
Re: Problem Starting Online Version
I get the error when trying to run the Online version at "this page" (http://www.sweethome3d.com/SweetHome3DOnline.jsp). I have not attempted to install or use a download version. Thanks.
Re: Problem Starting Online Version
I Do get this error when I try to run my own version. And another question. In what directory should I have catalogs of furniture and textures?
Re: Problem Starting Online Version
P.S. ClassNotFoundException com.eteks.sweethome3d.applet.SweetHome3DViever
Re: Problem Starting Online Version
StNff, I don't understand why you report an issue with com.eteks.sweethome3d.applet.SweetHome3DViewer in a subject about the Online version (i.e. com.eteks.sweethome3d.applet.SweetHome3DApplet class). What are you trying to do?
Emmanuel Puybaret, Sweet Home 3D creator
<font><font class=""> Re: Проблема Начиная Электронная версия </font></font>
I have compiled applet (ANT utility). I have this error when trying to start SweetHome3DApplet.html.
http://osnova-mebel.com/3d/SweetHome3DApplet.html
http://osnova-mebel.com/3d/SweetHome3DApplet.html
Re: <font><font class=""> Re: Проблема Начиная Электронная версия </font></font>
P.S.
I have the error ClassNotFoundException com.eteks.sweethome3d.applet.SweetHome3DApplet.
I think I had another error yesterday.
I have the error ClassNotFoundException com.eteks.sweethome3d.applet.SweetHome3DApplet.
I think I had another error yesterday.
Re: <font><font class=""> Re: Проблема Начиная Электронная версия </font></font>
I had JDK 7.
Now I have JDK 5 (As in the instructions).
Log compilation:
D:\1>ant javaWebStart
Buildfile: D:\1\build.xml
build:
[mkdir] Created dir: D:\1\build\classes
[javac] D:\1\build.xml:43: warning: 'includeantruntime' was not set, defaulting to build.sysclasspath=last; set to f
alse for repeatable builds
[javac] Compiling 2 source files to D:\1\build\classes
[javac] D:\1\build.xml:46: warning: 'includeantruntime' was not set, defaulting to build.sysclasspath=last; set to f
alse for repeatable builds
[javac] Compiling 193 source files to D:\1\build\classes
[javac] Note: Some input files use unchecked or unsafe operations.
[javac] Note: Recompile with -Xlint:unchecked for details.
[copy] Copying 261 files to D:\1\build\classes
[zip] Building zip: D:\1\build\SweetHome3D.jar
[delete] Deleting directory D:\1\build\classes
application:
[zip] Building zip: D:\1\build\SweetHome3DStandalone.jar
[move] Moving 1 file to D:\1\build
furniture:
[zip] Building zip: D:\1\build\Furniture.jar
textures:
[zip] Building zip: D:\1\build\Textures.jar
help:
[zip] Building zip: D:\1\build\Help.jar
jogl-java3d:
[zip] Building zip: D:\1\build\macosx\java3d-1.6\jogl-java3d.jar
java3dLibraries:
[mkdir] Created dir: D:\1\deploy\lib\windows\i386
[zip] Building zip: D:\1\deploy\lib\windows\i386\java3d.jar
[mkdir] Created dir: D:\1\deploy\lib\windows\x64
[zip] Building zip: D:\1\deploy\lib\windows\x64\java3d.jar
[mkdir] Created dir: D:\1\deploy\lib\linux\i386
[zip] Building zip: D:\1\deploy\lib\linux\i386\java3d.jar
[mkdir] Created dir: D:\1\deploy\lib\linux\x64
[zip] Building zip: D:\1\deploy\lib\linux\x64\java3d.jar
[mkdir] Created dir: D:\1\deploy\lib\macosx
[zip] Building zip: D:\1\deploy\lib\macosx\java3d.jar
javaWebStart:
[mkdir] Created dir: D:\1\build\JNLP-INF
[copy] Copying 1 file to D:\1\build\JNLP-INF
[zip] Building zip: D:\1\deploy\lib\SweetHome3DJavaWebStartBootstrap.jar
[zip] Building zip: D:\1\deploy\lib\SweetHome3D.jar
[copy] Copying 6 files to D:\1\deploy\lib
[delete] Deleting directory D:\1\build
[input] Enter Passphrase for keystore:
1111
[signjar] Signing JAR: D:\1\deploy\lib\Loader3DS1_2u.jar to D:\1\deploy\lib\Loader3DS1_2u.jar as SweetHome3D
[signjar] jarsigner error: java.lang.RuntimeException: keystore load: D:\1\keys.keytool (═х єфрхЄё эрщЄш єърчрээ√щ Їр
щы)
BUILD FAILED
D:\1\build.xml:238: jarsigner returned: 1
Total time: 1 minute 40 seconds
Tell me, what's the problem?
Now I have JDK 5 (As in the instructions).
Log compilation:
D:\1>ant javaWebStart
Buildfile: D:\1\build.xml
build:
[mkdir] Created dir: D:\1\build\classes
[javac] D:\1\build.xml:43: warning: 'includeantruntime' was not set, defaulting to build.sysclasspath=last; set to f
alse for repeatable builds
[javac] Compiling 2 source files to D:\1\build\classes
[javac] D:\1\build.xml:46: warning: 'includeantruntime' was not set, defaulting to build.sysclasspath=last; set to f
alse for repeatable builds
[javac] Compiling 193 source files to D:\1\build\classes
[javac] Note: Some input files use unchecked or unsafe operations.
[javac] Note: Recompile with -Xlint:unchecked for details.
[copy] Copying 261 files to D:\1\build\classes
[zip] Building zip: D:\1\build\SweetHome3D.jar
[delete] Deleting directory D:\1\build\classes
application:
[zip] Building zip: D:\1\build\SweetHome3DStandalone.jar
[move] Moving 1 file to D:\1\build
furniture:
[zip] Building zip: D:\1\build\Furniture.jar
textures:
[zip] Building zip: D:\1\build\Textures.jar
help:
[zip] Building zip: D:\1\build\Help.jar
jogl-java3d:
[zip] Building zip: D:\1\build\macosx\java3d-1.6\jogl-java3d.jar
java3dLibraries:
[mkdir] Created dir: D:\1\deploy\lib\windows\i386
[zip] Building zip: D:\1\deploy\lib\windows\i386\java3d.jar
[mkdir] Created dir: D:\1\deploy\lib\windows\x64
[zip] Building zip: D:\1\deploy\lib\windows\x64\java3d.jar
[mkdir] Created dir: D:\1\deploy\lib\linux\i386
[zip] Building zip: D:\1\deploy\lib\linux\i386\java3d.jar
[mkdir] Created dir: D:\1\deploy\lib\linux\x64
[zip] Building zip: D:\1\deploy\lib\linux\x64\java3d.jar
[mkdir] Created dir: D:\1\deploy\lib\macosx
[zip] Building zip: D:\1\deploy\lib\macosx\java3d.jar
javaWebStart:
[mkdir] Created dir: D:\1\build\JNLP-INF
[copy] Copying 1 file to D:\1\build\JNLP-INF
[zip] Building zip: D:\1\deploy\lib\SweetHome3DJavaWebStartBootstrap.jar
[zip] Building zip: D:\1\deploy\lib\SweetHome3D.jar
[copy] Copying 6 files to D:\1\deploy\lib
[delete] Deleting directory D:\1\build
[input] Enter Passphrase for keystore:
1111
[signjar] Signing JAR: D:\1\deploy\lib\Loader3DS1_2u.jar to D:\1\deploy\lib\Loader3DS1_2u.jar as SweetHome3D
[signjar] jarsigner error: java.lang.RuntimeException: keystore load: D:\1\keys.keytool (═х єфрхЄё эрщЄш єърчрээ√щ Їр
щы)
BUILD FAILED
D:\1\build.xml:238: jarsigner returned: 1
Total time: 1 minute 40 seconds
Tell me, what's the problem?
Re: <font><font class=""> Re: Проблема Начиная Электронная версия </font></font>
Reading the README.TXT file coming with the source file would have given you the answer:
Note that the last part of the Ant targets javaWebStart, applet and viewer requires a passphrase for keystore to sign the deployed jars. For security reasons, the required file keys.keytool isn't provided with this source code. You'll have first to generate this file and choose a passphrase, with the following command run in the directory where you uncompressed this archive:
keytool -genkey -keystore keys.keytool -alias SweetHome3D
Emmanuel Puybaret, Sweet Home 3D creator
Who is online
Users browsing this forum: No registered users and 2 guests